Reaction Details
TargetCasein kinase I isoform epsilon
LigandBDBM274713
Substrate/Competitorn/a
Meas. Tech.Kinase Assay
pH7.4±n/a
Temperature298.15±n/a K
IC50 0.222±n/a nM
Commentsextracted
Citation Velaparthi, UDarne, CPDodd, DSSampognaro, AJWittman, MDKumaravel, SMullick, DLiu, PRachamreddy, CR Substituted imidazoles as casein kinase 1 D/E inhibitors US Patent US9556179 Publication Date 1/31/2017
 
Casein kinase I isoform epsilon
Name:Casein kinase I isoform epsilon
Type:Protein
Mol. Mass.:47340.25
Organism:Homo sapiens (Human)
Description:P49674
Residue:416
BDBM274713
NameBDBM274713
Synonyms:2-Fluoro-N-(6-(1-(2-fluoroethyl)-4-(4-fluorophenyl)-2-methyl-1H-imidazol-5-yl)imidazo[1,2-b]pyridazin-2-yl)isonicotinamide | US9556179, Compound 288
TypeSmall organic molecule
Emp. Form.C24H18F3N7O
Mol. Mass.477.4412
SMILESCc1nc(c(-c2ccc3nc(NC(=O)c4ccnc(F)c4)cn3n2)n1CCF)-c1ccc(F)cc1