Reaction Details
TargetCasein kinase I isoform delta
LigandBDBM274720
Substrate/Competitorn/a
Meas. Tech.Kinase Assay
pH7.4±n/a
Temperature298.15±n/a K
IC50 0.126±n/a nM
Commentsextracted
Citation Velaparthi, UDarne, CPDodd, DSSampognaro, AJWittman, MDKumaravel, SMullick, DLiu, PRachamreddy, CR Substituted imidazoles as casein kinase 1 D/E inhibitors US Patent US9556179 Publication Date 1/31/2017
 
Casein kinase I isoform delta
Name:Casein kinase I isoform delta
Type:Enzyme
Mol. Mass.:47356.76
Organism:Homo sapiens (Human)
Description:P48730
Residue:415
BDBM274720
NameBDBM274720
Synonyms:N-(6-(4-(4-chlorophenyl)-2-methyl- 1-(2,2,2-trifluoroethyl)-1H- imidazol-5-yl)imidazo[1,2-b] pyridazin-2-yl)-2-fluoroisonicotin- amide | US9556179, Compound 295
TypeSmall organic molecule
Emp. Form.C24H16ClF4N7O
Mol. Mass.529.877
SMILESCc1nc(c(-c2ccc3nc(NC(=O)c4ccnc(F)c4)cn3n2)n1CC(F)(F)F)-c1ccc(Cl)cc1