Reaction Details
TargetCasein kinase I isoform epsilon
LigandBDBM274762
Substrate/Competitorn/a
Meas. Tech.Kinase Assay
pH7.4±n/a
Temperature298.15±n/a K
IC50 0.768±n/a nM
Commentsextracted
Citation Velaparthi, UDarne, CPDodd, DSSampognaro, AJWittman, MDKumaravel, SMullick, DLiu, PRachamreddy, CR Substituted imidazoles as casein kinase 1 D/E inhibitors US Patent US9556179 Publication Date 1/31/2017
 
Casein kinase I isoform epsilon
Name:Casein kinase I isoform epsilon
Type:Protein
Mol. Mass.:47340.25
Organism:Homo sapiens (Human)
Description:P49674
Residue:416
BDBM274762
NameBDBM274762
Synonyms:N-(6-(4-(4-fluorophenyl)-1,2- dimethyl-1H-imidazol-5-yl) imidazo[1,2-b]pyridazin-2- yl)-4-methyl-1H-pyrrole-2- carboxamide | US9556179, Compound 338
TypeSmall organic molecule
Emp. Form.C23H20FN7O
Mol. Mass.429.4496
SMILESCc1c[nH]c(c1)C(=O)Nc1cn2nc(ccc2n1)-c1c(nc(C)n1C)-c1ccc(F)cc1