Reaction Details
TargetAlpha-mannosidase 2
LigandBDBM84868
Substrate/Competitorn/a
Meas. Tech.Inhibition Assay
pH5.75±0
Temperature298.15±0 K
Ki 2.7±0.0 nM
IC50 29±0.0 nM
Citation Kuntz, DANakayama, SShea, KHori, HUto, YNagasawa, HRose, DR Structural investigation of the binding of 5-substituted swainsonine analogues to Golgi alpha-mannosidase II. Chembiochem11:673-80 (2010) 
 
Alpha-mannosidase 2
Name:Alpha-mannosidase 2
Type:Protein
Mol. Mass.:126735.79
Organism:Drosophila melanogaster (Fruit fly)
Description:Q24451
Residue:1108
BDBM84868
NameBDBM84868
Synonyms:Swainsonine derivative, 3
TypeSmall organic molecule
Emp. Form.C17H23NO4
Mol. Mass.305.3688
SMILESCc1ccc(cc1)C(=O)C[C@H]1CC[C@@H](O)C2[C@H](O)[C@H](O)CN12