Reaction Details
TargetAlpha-mannosidase 2
LigandBDBM84871
Substrate/Competitorn/a
Meas. Tech.Inhibition Assay
pH5.75±0
Temperature298.15±0 K
IC50 44±0.0 nM
Citation Kuntz, DANakayama, SShea, KHori, HUto, YNagasawa, HRose, DR Structural investigation of the binding of 5-substituted swainsonine analogues to Golgi alpha-mannosidase II. Chembiochem11:673-80 (2010) 
 
Alpha-mannosidase 2
Name:Alpha-mannosidase 2
Type:Protein
Mol. Mass.:126735.79
Organism:Drosophila melanogaster (Fruit fly)
Description:Q24451
Residue:1108
BDBM84871
NameBDBM84871
Synonyms:Swainsonine derivative, 6
TypeSmall organic molecule
Emp. Form.C20H31NO3
Mol. Mass.333.465
SMILESCC(C)(C)c1ccc(CC[C@H]2CC[C@@H](O)C3[C@H](O)[C@H](O)CN23)cc1