Reaction Details
TargetCannabinoid receptor 1
LigandBDBM84887
Substrate/Competitorn/a
Ki 89±n/a nM
CommentsPDSP_1826
Citation Compton, DRRice, KCDe Costa, BRRazdan, RKMelvin, LSJohnson, MRMartin, BR Cannabinoid structure-activity relationships: correlation of receptor binding and in vivo activities. J Pharmacol Exp Ther265:218-26 (1993) Cannabinoid receptor 1
Name:Cannabinoid receptor 1
Type:G Protein-Coupled Receptor (GPCR)
Mol. Mass.:52856.55
Organism:Rattus norvegicus (rat)
Description:P20272
Residue:473
BDBM84887
NameBDBM84887
Synonyms:THC, 2-I-delta 8
TypeSmall organic molecule
Emp. Form.C21H29IO2
Mol. Mass.440.3582
SMILESCCCCCc1cc2OC(C)(C)[C@@H]3CCC(=C)C[C@H]3c2c(O)c1I