Reaction Details
TargetCannabinoid receptor 1
LigandBDBM84922
Substrate/Competitorn/a
Ki 87.6±n/a nM
CommentsPDSP_1832
Citation Compton, DRRice, KCDe Costa, BRRazdan, RKMelvin, LSJohnson, MRMartin, BR Cannabinoid structure-activity relationships: correlation of receptor binding and in vivo activities. J Pharmacol Exp Ther265:218-26 (1993) Cannabinoid receptor 1
Name:Cannabinoid receptor 1
Type:G Protein-Coupled Receptor (GPCR)
Mol. Mass.:52856.55
Organism:Rattus norvegicus (rat)
Description:P20272
Residue:473
BDBM84922
NameBDBM84922
Synonyms:THC, 5'-OH
TypeSmall organic molecule
Emp. Form.C21H30O3
Mol. Mass.330.4611
SMILESCC1=C[C@@H]2[C@@H](CC1)C(C)(C)Oc1cc(CCCCCO)cc(O)c21