Reaction Details
TargetCannabinoid receptor 1
LigandBDBM84894
Substrate/Competitorn/a
Ki 7.7±n/a nM
CommentsPDSP_1975
Citation Compton, DRRice, KCDe Costa, BRRazdan, RKMelvin, LSJohnson, MRMartin, BR Cannabinoid structure-activity relationships: correlation of receptor binding and in vivo activities. J Pharmacol Exp Ther265:218-26 (1993) Cannabinoid receptor 1
Name:Cannabinoid receptor 1
Type:G Protein-Coupled Receptor (GPCR)
Mol. Mass.:52856.55
Organism:Rattus norvegicus (rat)
Description:P20272
Residue:473
BDBM84894
NameBDBM84894
Synonyms:Bicyclic analogs XI | Bicyclic analogs XII
TypeSmall organic molecule
Emp. Form.C22H36O2
Mol. Mass.332.52
SMILESCCCCCCC(C)(C)c1ccc([C@@H]2C[C@H](O)CC[C@H]2C)c(O)c1