Reaction Details
TargetD(2) dopamine receptor
LigandBDBM84928
Substrate/Competitorn/a
Ki 0.01±n/a nM
CommentsPDSP_822
Citation Nagakura, YKadowaki, MTokoro, KTomoi, MMori, JKohsaka, M Pharmacological characterization of FK1052, a dihydropyridoindole derivative, as a new serotonin 3 and 4 dual receptor antagonist. J Pharmacol Exp Ther265:752-8 (1993) D(2) dopamine receptor
Name:D(2) dopamine receptor
Type:G Protein-Coupled Receptor (GPCR)
Mol. Mass.:50931.60
Organism:Rattus norvegicus (rat)
Description:P61169
Residue:444
BDBM84928
NameBDBM84928
Synonyms:CAS_125368 NSC_125368
TypeSmall organic molecule
Emp. Form.C18H19N3O
Mol. Mass.293.363
SMILESCc1nc[nH]c1CC1CCc2c(C)c3ccccc3n2C1=O