Reaction Details
Target5-hydroxytryptamine receptor 2A
LigandBDBM82516
Substrate/Competitorn/a
Ki 30.7±n/a nM
CommentsPDSP_282
Citation Nelson, DLLucaites, VLAudia, JENissen, JSWainscott, DB Species differences in the pharmacology of the 5-hydroxytryptamine2 receptor: structurally specific differentiation by ergolines and tryptamines. J Pharmacol Exp Ther265:1272-9 (1993) 5-hydroxytryptamine receptor 2A
Name:5-hydroxytryptamine receptor 2A
Type:Enzyme Catalytic Domain
Mol. Mass.:52679.13
Organism:PIG
Description:5-HT2 0 0::P50129
Residue:470
BDBM82516
NameBDBM82516
Synonyms:AMESERGIDE NSC_60740
TypeSmall organic molecule
Emp. Form.C25H35N3O
Mol. Mass.393.5649
SMILESCC(C)n1cc2CC3C(CC(CN3C)C(=O)NC3CCCCC3)c3cccc1c23