Reaction Details
Target5-hydroxytryptamine receptor 2C
LigandBDBM81446
Substrate/Competitorn/a
Ki 31.1±n/a nM
CommentsPDSP_796
Citation Nelson, DLLucaites, VLAudia, JENissen, JSWainscott, DB Species differences in the pharmacology of the 5-hydroxytryptamine2 receptor: structurally specific differentiation by ergolines and tryptamines. J Pharmacol Exp Ther265:1272-9 (1993) 5-hydroxytryptamine receptor 2C
Name:5-hydroxytryptamine receptor 2C
Type:G Protein-Coupled Receptor (GPCR)
Mol. Mass.:51836.79
Organism:Homo sapiens (Human)
Description:P28335
Residue:458
BDBM81446
NameBDBM81446
Synonyms:CAS_60-79-7 NSC_104873
TypeSmall organic molecule
Emp. Form.C19H23N3O2
Mol. Mass.325.4048
SMILESCC(CO)NC(=O)C1CN(C)C2Cc3c[nH]c4cccc(C2=C1)c34