Reaction Details
Target5-hydroxytryptamine receptor 2A
LigandBDBM84939
Substrate/Competitorn/a
Ki 56.8±n/a nM
CommentsPDSP_1130
Citation Nelson, DLLucaites, VLAudia, JENissen, JSWainscott, DB Species differences in the pharmacology of the 5-hydroxytryptamine2 receptor: structurally specific differentiation by ergolines and tryptamines. J Pharmacol Exp Ther265:1272-9 (1993) 5-hydroxytryptamine receptor 2A
Name:5-hydroxytryptamine receptor 2A
Type:Enzyme Catalytic Domain
Mol. Mass.:52607.65
Organism:Monkey
Description:5-HT2 0 Monkey::P50128
Residue:471
BDBM84939
NameBDBM84939
Synonyms:1,6-Dimethylergoline-8β-carboxylic acid 2-hydroxy-1-methylpropyl ester LY-108742
TypeSmall organic molecule
Emp. Form.C21H28N2O3
Mol. Mass.356.4586
SMILESCC(O)C(C)OC(=O)[C@@H]1C[C@H]2[C@@H](Cc3cn(C)c4cccc2c34)N(C)C1