Reaction Details
Target5-hydroxytryptamine receptor 6
LigandBDBM22869
Substrate/Competitorn/a
Ki 9.5±n/a nM
CommentsPDSP_552
Citation Kohen, RMetcalf, MAKhan, NDruck, THuebner, KLachowicz, JEMeltzer, HYSibley, DRRoth, BLHamblin, MW Cloning, characterization, and chromosomal localization of a human 5-HT6 serotonin receptor. J Neurochem66:47-56 (1996) 
 
5-hydroxytryptamine receptor 6
Name:5-hydroxytryptamine receptor 6
Type:G Protein-Coupled Receptor (GPCR)
Mol. Mass.:46968.43
Organism:Homo sapiens (Human)
Description:P50406
Residue:440
BDBM22869
NameBDBM22869
Synonyms:6-chloro-10-(4-methylpiperazin-1-yl)-2,9-diazatricyclo[9.4.0.0^{3,8}]pentadeca-1,3(8),4,6,10,12,14-heptaene Clozapine US10259786, Clozapine
TypeSmall organic molecule
Emp. Form.C18H19ClN4
Mol. Mass.326.823
SMILESCN1CCN(CC1)C1=c2ccccc2=Nc2ccc(Cl)cc2N1