Reaction Details
Target5-hydroxytryptamine receptor 6
LigandBDBM84945
Substrate/Competitorn/a
Ki 11±n/a nM
CommentsPDSP_952
Citation Kohen, RMetcalf, MAKhan, NDruck, THuebner, KLachowicz, JEMeltzer, HYSibley, DRRoth, BLHamblin, MW Cloning, characterization, and chromosomal localization of a human 5-HT6 serotonin receptor. J Neurochem66:47-56 (1996) 
 
5-hydroxytryptamine receptor 6
Name:5-hydroxytryptamine receptor 6
Type:G Protein-Coupled Receptor (GPCR)
Mol. Mass.:46968.43
Organism:Homo sapiens (Human)
Description:P50406
Residue:440
BDBM84945
NameBDBM84945
Synonyms:CAS_122265 NSC_122265
TypeSmall organic molecule
Emp. Form.C19H20N2S
Mol. Mass.308.441
SMILESCN(C)CCSc1nc2ccccc2cc1-c1ccccc1