Reaction Details
Target5-hydroxytryptamine receptor 6
LigandBDBM82479
Substrate/Competitorn/a
Ki 10±n/a nM
CommentsPDSP_1408
Citation Kohen, RMetcalf, MAKhan, NDruck, THuebner, KLachowicz, JEMeltzer, HYSibley, DRRoth, BLHamblin, MW Cloning, characterization, and chromosomal localization of a human 5-HT6 serotonin receptor. J Neurochem66:47-56 (1996) 
 
5-hydroxytryptamine receptor 6
Name:5-hydroxytryptamine receptor 6
Type:G Protein-Coupled Receptor (GPCR)
Mol. Mass.:46968.43
Organism:Homo sapiens (Human)
Description:P50406
Residue:440
BDBM82479
NameBDBM82479
Synonyms:CAS_132539-06-1 OLANZAPINE | USRE49340, Rank 2
TypeSmall organic molecule
Emp. Form.C17H20N4S
Mol. Mass.312.432
SMILESCN1CCN(CC1)C1=c2cc(C)sc2=Nc2ccccc2N1