Reaction Details
Target5-hydroxytryptamine receptor 2A
LigandBDBM50131440
Substrate/Competitorn/a
Ki 6.3±n/a nM
CommentsPDSP_1205
Citation Roth, BLTandra, SBurgess, LHSibley, DRMeltzer, HY D4 dopamine receptor binding affinity does not distinguish between typical and atypical antipsychotic drugs. Psychopharmacology (Berl)120:365-8 (1995) 
 
5-hydroxytryptamine receptor 2A
Name:5-hydroxytryptamine receptor 2A
Type:G Protein-Coupled Receptor (GPCR)
Mol. Mass.:52852.05
Organism:Rattus norvegicus (rat)
Description:Rat cortex membranes 5-HT2A receptors.
Residue:471
BDBM50131440
NameBDBM50131440
Synonyms:10-(2-(1-methylpiperidin-2-yl)ethyl)-2-(methylsulfinyl)-10H-phenothiazine CHEMBL1088 NC-123 TPS-23
TypeSmall organic molecule
Emp. Form.C21H26N2OS2
Mol. Mass.386.574
SMILESCN1CCCCC1CCN1c2ccccc2Sc2ccc(cc12)S(C)=O