Reaction Details
Target5-hydroxytryptamine receptor 2A
LigandBDBM50102325
Substrate/Competitorn/a
Ki 12.5±n/a nM
CommentsPDSP_1455
Citation Roth, BLTandra, SBurgess, LHSibley, DRMeltzer, HY D4 dopamine receptor binding affinity does not distinguish between typical and atypical antipsychotic drugs. Psychopharmacology (Berl)120:365-8 (1995) 
 
5-hydroxytryptamine receptor 2A
Name:5-hydroxytryptamine receptor 2A
Type:G Protein-Coupled Receptor (GPCR)
Mol. Mass.:52852.05
Organism:Rattus norvegicus (rat)
Description:Rat cortex membranes 5-HT2A receptors.
Residue:471
BDBM50102325
NameBDBM50102325
Synonyms:6-(4-Methyl-piperazin-1-yl)-11H-dibenzo[b,e]azepine Perlapine
TypeSmall organic molecule
Emp. Form.C19H21N3
Mol. Mass.291.3901
SMILESCN1CCN(CC1)C1=Nc2ccccc2Cc2ccccc12