Reaction Details
TargetD(4) dopamine receptor
LigandBDBM22871
Substrate/Competitorn/a
Ki 12±n/a nM
CommentsPDSP_1090
Citation Roth, BLTandra, SBurgess, LHSibley, DRMeltzer, HY D4 dopamine receptor binding affinity does not distinguish between typical and atypical antipsychotic drugs. Psychopharmacology (Berl)120:365-8 (1995) 
 
D(4) dopamine receptor
Name:D(4) dopamine receptor
Type:Enzyme Catalytic Domain
Mol. Mass.:41307.65
Organism:RAT
Description:DOPAMINE D4.4 0 RAT::P30729
Residue:387
BDBM22871
NameBDBM22871
Synonyms:13-chloro-10-(4-methylpiperazin-1-yl)-2-oxa-9-azatricyclo[9.4.0.0^{3,8}]pentadeca-1(11),3,5,7,9,12,14-heptaene 8-chloro-6-(4-methylpiperazino)benzo[b][1,4]benzoxazepine;succinic acid CL71,563 Loxapine
TypeSmall organic molecule
Emp. Form.C18H18ClN3O
Mol. Mass.327.808
SMILESCN1CCN(CC1)C1=Nc2ccccc2Oc2ccc(Cl)cc12