Reaction Details
TargetD(4) dopamine receptor
LigandBDBM81770
Substrate/Competitorn/a
Ki 721±n/a nM
CommentsPDSP_1797
Citation Roth, BLTandra, SBurgess, LHSibley, DRMeltzer, HY D4 dopamine receptor binding affinity does not distinguish between typical and atypical antipsychotic drugs. Psychopharmacology (Berl)120:365-8 (1995) 
 
D(4) dopamine receptor
Name:D(4) dopamine receptor
Type:Enzyme Catalytic Domain
Mol. Mass.:41307.65
Organism:RAT
Description:DOPAMINE D4.4 0 RAT::P30729
Residue:387
BDBM81770
NameBDBM81770
Synonyms:CAS_82650-83-7 TENILAPINE
TypeSmall organic molecule
Emp. Form.C17H16N4S2
Mol. Mass.340.466
SMILESCN1CCN(CC1)C1=Nc2cscc2C(=CC#N)c2cscc12