Reaction Details
TargetD(4) dopamine receptor
LigandBDBM50002338
Substrate/Competitorn/a
Ki 3.9±n/a nM
CommentsPDSP_1849
Citation Roth, BLTandra, SBurgess, LHSibley, DRMeltzer, HY D4 dopamine receptor binding affinity does not distinguish between typical and atypical antipsychotic drugs. Psychopharmacology (Berl)120:365-8 (1995) 
 
D(4) dopamine receptor
Name:D(4) dopamine receptor
Type:Enzyme Catalytic Domain
Mol. Mass.:41307.65
Organism:RAT
Description:DOPAMINE D4.4 0 RAT::P30729
Residue:387
BDBM50002338
NameBDBM50002338
Synonyms:(Thioridazine)10-[2-(1-Methyl-piperidin-2-yl)-ethyl]-2-methylsulfanyl-10H-phenothiazine 10-[2-(1-Methyl-piperidin-2-yl)-ethyl]-2-methylsulfanyl-10H-phenothiazine CHEMBL479 MELLARIL-S TP-21 | US9504692, Thioridazine
TypeSmall organic molecule
Emp. Form.C21H26N2S2
Mol. Mass.370.575
SMILESCSc1ccc2Sc3ccccc3N(CCC3CCCCN3C)c2c1