Reaction Details
TargetNeuronal acetylcholine receptor subunit alpha-4
LigandBDBM50060582
Substrate/Competitorn/a
Ki 962±n/a nM
CommentsPDSP_632
Citation Gopalakrishnan, MMonteggia, LMAnderson, DJMolinari, EJPiattoni-Kaplan, MDonnelly-Roberts, DArneric, SPSullivan, JP Stable expression, pharmacologic properties and regulation of the human neuronal nicotinic acetylcholine alpha 4 beta 2 receptor. J Pharmacol Exp Ther276:289-97 (1996) Neuronal acetylcholine receptor subunit alpha-4
Name:Neuronal acetylcholine receptor subunit alpha-4
Type:n/a
Mol. Mass.:69963.49
Organism:Homo sapiens (Human)
Description:NACHRA4
Residue:627
BDBM50060582
NameBDBM50060582
Synonyms:1,10-Bis(trimethyl ammonium)decane dibromide CHEMBL1134 DECAMETHONIUM BROMIDE N,N,N'',N''-Tetramethyl-decane-1,10-diammonium; dibromide Syncurine | decane-1,10-bis(trimethylammonium bromide)
TypeSmall organic molecule
Emp. Form.C16H38N2
Mol. Mass.258.4852
SMILESC[N+](C)(C)CCCCCCCCCC[N+](C)(C)C