Reaction Details
TargetNeuronal acetylcholine receptor subunit alpha-4
LigandBDBM50004108
Substrate/Competitorn/a
Ki 1.05±n/a nM
CommentsPDSP_1311
Citation Gopalakrishnan, MMonteggia, LMAnderson, DJMolinari, EJPiattoni-Kaplan, MDonnelly-Roberts, DArneric, SPSullivan, JP Stable expression, pharmacologic properties and regulation of the human neuronal nicotinic acetylcholine alpha 4 beta 2 receptor. J Pharmacol Exp Ther276:289-97 (1996) Neuronal acetylcholine receptor subunit alpha-4
Name:Neuronal acetylcholine receptor subunit alpha-4
Type:n/a
Mol. Mass.:69963.49
Organism:Homo sapiens (Human)
Description:NACHRA4
Residue:627
BDBM50004108
NameBDBM50004108
Synonyms:(+-)-nicotine (RS)-nicotine CHEMBL440464 Nicotine-(+) US11667638, Example Nicotine US9284322, Nicotine nicotine
TypeSmall organic molecule
Emp. Form.C10H14N2
Mol. Mass.162.2316
SMILESCN1CCCC1c1cccnc1