Reaction Details
TargetGlutamate receptor 3
LigandBDBM84949
Substrate/Competitorn/a
Ki 84±n/a nM
CommentsPDSP_1986
Citation Shimizu-Sasamata, MKawasaki-Yatsugi, SOkada, MSakamoto, SYatsugi, STogami, JHatanaka, KOhmori, JKoshiya, KUsuda, SMurase, K YM90K: pharmacological characterization as a selective and potent alpha-amino-3-hydroxy-5-methylisoxazole-4-propionate/kainate receptor antagonist. J Pharmacol Exp Ther276:84-92 (1996) Glutamate receptor 3
Name:Glutamate receptor 3
Type:Enzyme Catalytic Domain
Mol. Mass.:100383.57
Organism:RAT
Description:Glutamate-AMPA GRIA3 RAT::P19492
Residue:888
BDBM84949
NameBDBM84949
Synonyms:CAS_3035216 YM90k
TypeSmall organic molecule
Emp. Form.C11H7N5O4
Mol. Mass.273.2044
SMILESON(O)c1cc2=NC(=O)C(=O)N=c2cc1-n1ccnc1