Reaction Details
TargetSodium-dependent serotonin transporter
LigandBDBM22914
Substrate/Competitorn/a
Ki>10000±n/a nM
CommentsPDSP_1847
Citation Leurs, RTulp, MTMenge, WMAdolfs, MJZuiderveld, OPTimmerman, H Evaluation of the receptor selectivity of the H3 receptor antagonists, iodophenpropit and thioperamide: an interaction with the 5-HT3 receptor revealed. Br J Pharmacol116:2315-21 (1995) 
 
Sodium-dependent serotonin transporter
Name:Sodium-dependent serotonin transporter
Type:Enzyme Catalytic Domain
Mol. Mass.:70110.68
Organism:GUINEA PIG
Description:5-HT Transporter SLC6A4 GUINEA PIG::O35899
Residue:630
BDBM22914
NameBDBM22914
Synonyms:CHEMBL260374 Thioperamide | US11622967, Compound Thioperamide
TypeSmall organic molecule
Emp. Form.C15H24N4S
Mol. Mass.292.443
SMILESS=C(NC1CCCCC1)N1CCC(CC1)c1cnc[nH]1