Reaction Details
TargetGlutamate receptor ionotropic, NMDA 1
LigandBDBM22913
Substrate/Competitorn/a
Ki>10000±n/a nM
CommentsPDSP_2292
Citation Leurs, RTulp, MTMenge, WMAdolfs, MJZuiderveld, OPTimmerman, H Evaluation of the receptor selectivity of the H3 receptor antagonists, iodophenpropit and thioperamide: an interaction with the 5-HT3 receptor revealed. Br J Pharmacol116:2315-21 (1995) 
 
Glutamate receptor ionotropic, NMDA 1
Name:Glutamate receptor ionotropic, NMDA 1
Type:Enzyme Catalytic Domain
Mol. Mass.:105533.40
Organism:RAT
Description:P35439
Residue:938
BDBM22913
NameBDBM22913
Synonyms:CHEMBL1237146 Iodophenpropit | {[3-(1H-imidazol-5-yl)propyl]sulfanyl}-N''-[2-(4-iodophenyl)ethyl]methanimidamide
TypeSmall organic molecule
Emp. Form.C15H19IN4S
Mol. Mass.414.308
SMILESNC(SCCCc1cnc[nH]1)=NCCc1ccc(I)cc1