Reaction Details
TargetKappa-type opioid receptor
LigandBDBM22913
Substrate/Competitorn/a
Ki>10000±n/a nM
CommentsPDSP_2292
Citation Leurs, RTulp, MTMenge, WMAdolfs, MJZuiderveld, OPTimmerman, H Evaluation of the receptor selectivity of the H3 receptor antagonists, iodophenpropit and thioperamide: an interaction with the 5-HT3 receptor revealed. Br J Pharmacol116:2315-21 (1995) 
 
Kappa-type opioid receptor
Name:Kappa-type opioid receptor
Type:G Protein-Coupled Receptor (GPCR)
Mol. Mass.:42692.90
Organism:Rattus norvegicus (rat)
Description:P34975
Residue:380
BDBM22913
NameBDBM22913
Synonyms:CHEMBL1237146 Iodophenpropit | {[3-(1H-imidazol-5-yl)propyl]sulfanyl}-N''-[2-(4-iodophenyl)ethyl]methanimidamide
TypeSmall organic molecule
Emp. Form.C15H19IN4S
Mol. Mass.414.308
SMILESNC(SCCCc1cnc[nH]1)=NCCc1ccc(I)cc1