Reaction Details
TargetD(2) dopamine receptor
LigandBDBM50008782
Substrate/Competitorn/a
Ki 0.12±n/a nM
CommentsPDSP_789
Citation Seeman, PVan Tol, HH Deriving the therapeutic concentrations for clozapine and haloperidol: the apparent dissociation constant of a neuroleptic at the dopamine D2 or D4 receptor varies with the affinity of the competing radioligand. Eur J Pharmacol291:59-66 (1995) 
 
D(2) dopamine receptor
Name:D(2) dopamine receptor
Type:Enzyme Catalytic Domain
Mol. Mass.:50730.78
Organism:GUINEA PIG
Description:F1SM69
Residue:443
BDBM50008782
NameBDBM50008782
Synonyms:CHEMBL44237 Epidepride;N-(1-Ethyl-pyrrolidin-2-ylmethyl)-5-iodo-2,3-dimethoxy-benzamide | N-(1-Ethyl-pyrrolidin-2-ylmethyl)-5-iodo-2,3-dimethoxy-benzamide (epidepride)
TypeSmall organic molecule
Emp. Form.C16H23IN2O3
Mol. Mass.418.2699
SMILESCCN1CCC[C@H]1CNC(=O)c1cc(I)cc(OC)c1OC