Reaction Details
TargetD(2) dopamine receptor
LigandBDBM50005120
Substrate/Competitorn/a
Ki 0.01±n/a nM
CommentsPDSP_1304
Citation Seeman, PVan Tol, HH Deriving the therapeutic concentrations for clozapine and haloperidol: the apparent dissociation constant of a neuroleptic at the dopamine D2 or D4 receptor varies with the affinity of the competing radioligand. Eur J Pharmacol291:59-66 (1995) 
 
D(2) dopamine receptor
Name:D(2) dopamine receptor
Type:Cell-surface receptors
Mol. Mass.:50647.10
Organism:Homo sapiens (Human)
Description:P14416
Residue:443
BDBM50005120
NameBDBM50005120
Synonyms:CHEMBL274491 N-(1-Benzyl-2-methyl-pyrrolidin-3-yl)-5-chloro-2-methoxy-4-methylamino-benzamide YM-09151-2
TypeSmall organic molecule
Emp. Form.C21H26ClN3O2
Mol. Mass.387.903
SMILESCNc1cc(OC)c(cc1Cl)C(=O)N[C@H]1CCN(Cc2ccccc2)[C@H]1C