Reaction Details
TargetHistamine H2 receptor
LigandBDBM7966
Substrate/Competitorn/a
Ki 17±n/a nM
CommentsPDSP_934
Citation Borsini, FGiraldo, EMonferini, EAntonini, GParenti, MBietti, GDonetti, A BIMT 17, a 5-HT2A receptor antagonist and 5-HT1A receptor full agonist in rat cerebral cortex. Naunyn Schmiedebergs Arch Pharmacol352:276-82 (1995) 
 
Histamine H2 receptor
Name:Histamine H2 receptor
Type:Enzyme Catalytic Domain
Mol. Mass.:40269.37
Organism:RAT
Description:HISTAMINE H2 HRH2 RAT::P25102
Residue:358
BDBM7966
NameBDBM7966
Synonyms:2-(1H-imidazol-4-yl)ethan-1-amine CHEMBL90 Ergotidine Histamine Peremin | [3H]histamine
TypeSmall organic molecule
Emp. Form.C5H9N3
Mol. Mass.111.1451
SMILESNCCc1cnc[nH]1