Reaction Details
TargetSubstance-P receptor
LigandBDBM50001450
Substrate/Competitorn/a
Ki 0.24±n/a nM
CommentsPDSP_1775
Citation Kudlacz, EMShatzer, SAKnippenberg, RWLogan, DEPoirot, Mvan Giersbergen, PLBurkholder, TP In vitro and in vivo characterization of MDL 105,212A, a nonpeptide NK-1/NK-2 tachykinin receptor antagonist. J Pharmacol Exp Ther277:840-51 (1996) Substance-P receptor
Name:Substance-P receptor
Type:Enzyme Catalytic Domain
Mol. Mass.:46261.42
Organism:GUINEA PIG
Description:Neurokinin NK1 TACR1 GUINEA PIG::P30547
Residue:407
BDBM50001450
NameBDBM50001450
Synonyms:(SP)Arg-Pro-Lys-Pro-Gln-Gln-Phe-Phe-Gly-Leu-Met-NH2 Arg-Pro-Lys-Pro-Gln-Gln-Phe-Phe-Gly-Leu-Met-NH2 Arg-Pro-Lys-Pro-Gln-Gln-Phe-Phe-Gly-Leu-Met-NH2.(Substance P) ArgProLysProGlnGlnPhePheGlyLeuMet H-Arg-Pro-Lys-Pro-Gln-Gln-Phe-D-Phe-Gly-Leu-Met-NH2 Substance P Substance P analogue | tachykinin substance P (SP)
TypeSmall organic molecule
Emp. Form.C63H98N18O13S
Mol. Mass.1347.63
SMILES[#6]-[#16]-[#6]-[#6]-[#6@H](-[#7]-[#6](=O)-[#6@H](-[#6]-[#6](-[#6])-[#6])-[#7]-[#6](=O)-[#6]-[#7]-[#6](=O)-[#6@H](-[#6]-c1ccccc1)-[#7]-[#6](=O)-[#6@H](-[#6]-c1ccccc1)-[#7]-[#6](=O)-[#6@H](-[#6]-[#6]-[#6](-[#7])=O)-[#7]-[#6](=O)-[#6@H](-[#6]-[#6]-[#6](-[#7])=O)-[#7]-[#6](=O)-[#6@@H]-1-[#6]-[#6]-[#6]-[#7]-1-[#6](=O)-[#6@H](-[#6]-[#6]-[#6]-[#6]-[#7])-[#7]-[#6](=O)-[#6@@H]-1-[#6]-[#6]-[#6]-[#7]-1-[#6](=O)-[#6@@H](-[#7])-[#6]-[#6]-[#6]\[#7]=[#6](\[#7])-[#7])-[#6](-[#7])=O