Reaction Details
TargetSubstance-K receptor
LigandBDBM50071112
Substrate/Competitorn/a
Ki 7.32±n/a nM
CommentsPDSP_1755
Citation Kudlacz, EMShatzer, SAKnippenberg, RWLogan, DEPoirot, Mvan Giersbergen, PLBurkholder, TP In vitro and in vivo characterization of MDL 105,212A, a nonpeptide NK-1/NK-2 tachykinin receptor antagonist. J Pharmacol Exp Ther277:840-51 (1996) Substance-K receptor
Name:Substance-K receptor
Type:Enzyme Catalytic Domain
Mol. Mass.:43436.75
Organism:HAMSTER
Description:P51144
Residue:384
BDBM50071112
NameBDBM50071112
Synonyms:CHEMBL56835 SR 48968
TypeSmall organic molecule
Emp. Form.C31H35Cl2N3O2
Mol. Mass.552.535
SMILESCN(CC(CCN1CCC(CC1)(NC(C)=O)c1ccccc1)c1ccc(Cl)c(Cl)c1)C(=O)c1ccccc1