Reaction Details
TargetAlpha-1A adrenergic receptor
LigandBDBM50095027
Substrate/Competitorn/a
Ki 128±n/a nM
CommentsPDSP_1172
Citation Kehne, JHBaron, BMCarr, AAChaney, SFElands, JFeldman, DJFrank, RAvan Giersbergen, PLMcCloskey, TCJohnson, MPMcCarty, DRPoirot, MSenyah, YSiegel, BWWidmaier, C Preclinical characterization of the potential of the putative atypical antipsychotic MDL 100,907 as a potent 5-HT2A antagonist with a favorable CNS safety profile. J Pharmacol Exp Ther277:968-81 (1996) Alpha-1A adrenergic receptor
Name:Alpha-1A adrenergic receptor
Type:Protein
Mol. Mass.:51620.15
Organism:Rattus norvegicus (Rat)
Description:P43140
Residue:466
BDBM50095027
NameBDBM50095027
Synonyms:(2,3-Dimethoxy-phenyl)-{1-[2-(4-fluoro-phenyl)-ethyl]-piperidin-4-yl}-methanol (2,3-Dimethoxy-phenyl)-{1-[2-(4-fluoro-phenyl)-ethyl]-piperidin-4-yl}-methanol(MDL 100907) (R)-(2,3-Dimethoxy-phenyl)-{1-[2-(4-fluoro-phenyl)-ethyl]-piperidin-4-yl}-methanol (R)-(2,3-dimethoxyphenyl)(1-(4-fluorophenethyl)piperidin-4-yl)methanol MDL 100907 | MDL-100907
TypeSmall organic molecule
Emp. Form.C22H28FNO3
Mol. Mass.373.461
SMILESCOc1cccc([C@H](O)C2CCN(CCc3ccc(F)cc3)CC2)c1OC