Reaction Details
Target5-hydroxytryptamine receptor 2A
LigandBDBM50004327
Substrate/Competitorn/a
Ki 6.06±n/a nM
CommentsPDSP_1177
Citation Wainscott, DBLucaites, VLKursar, JDBaez, MNelson, DL Pharmacologic characterization of the human 5-hydroxytryptamine2B receptor: evidence for species differences. J Pharmacol Exp Ther276:720-7 (1996) 5-hydroxytryptamine receptor 2A
Name:5-hydroxytryptamine receptor 2A
Type:undefined
Mol. Mass.:52607.65
Organism:Homo sapiens (Human)
Description:P28223
Residue:471
BDBM50004327
NameBDBM50004327
Synonyms:(1-Phenethyl-piperidin-4-yl)-phenyl-methanol Glemanserin MDL-11939
TypeSmall organic molecule
Emp. Form.C20H25NO
Mol. Mass.295.4186
SMILESOC(C1CCN(CCc2ccccc2)CC1)c1ccccc1