Reaction Details
Target5-hydroxytryptamine receptor 2B
LigandBDBM50331286
Substrate/Competitorn/a
Ki 6.21±n/a nM
CommentsPDSP_139
Citation Wainscott, DBLucaites, VLKursar, JDBaez, MNelson, DL Pharmacologic characterization of the human 5-hydroxytryptamine2B receptor: evidence for species differences. J Pharmacol Exp Ther276:720-7 (1996) 5-hydroxytryptamine receptor 2B
Name:5-hydroxytryptamine receptor 2B
Type:Enzyme Catalytic Domain
Mol. Mass.:53668.47
Organism:RAT
Description:5-HT2B HTR2B RAT::P30994
Residue:479
BDBM50331286
NameBDBM50331286
Synonyms:2-(5-chloro-1H-indol-3-yl)ethanamine CHEMBL1288716
TypeSmall organic molecule
Emp. Form.C10H11ClN2
Mol. Mass.194.661
SMILESNCCc1c[nH]c2ccc(Cl)cc12