Reaction Details
Target5-hydroxytryptamine receptor 2B
LigandBDBM30853
Substrate/Competitorn/a
Ki 11±n/a nM
CommentsPDSP_146
Citation Wainscott, DBLucaites, VLKursar, JDBaez, MNelson, DL Pharmacologic characterization of the human 5-hydroxytryptamine2B receptor: evidence for species differences. J Pharmacol Exp Ther276:720-7 (1996) 5-hydroxytryptamine receptor 2B
Name:5-hydroxytryptamine receptor 2B
Type:G Protein-Coupled Receptor (GPCR)
Mol. Mass.:54312.47
Organism:Homo sapiens (Human)
Description:Receptor binding assays were performed using human clone stably expressed in CHO cells.
Residue:481
BDBM30853
NameBDBM30853
Synonyms:2-(5-fluoranyl-1H-indol-3-yl)ethanamine;hydrochloride 2-(5-fluoro-1H-indol-3-yl)ethylamine;hydrochloride CHEMBL275628 SMR000033820 | cid_197774
TypeSmall organic molecule
Emp. Form.C10H11FN2
Mol. Mass.178.2061
SMILESNCCc1c[nH]c2ccc(F)cc12