Reaction Details
Target5-hydroxytryptamine receptor 2B
LigandBDBM50130269
Substrate/Competitorn/a
Ki 8.56±n/a nM
CommentsPDSP_1095
Citation Wainscott, DBLucaites, VLKursar, JDBaez, MNelson, DL Pharmacologic characterization of the human 5-hydroxytryptamine2B receptor: evidence for species differences. J Pharmacol Exp Ther276:720-7 (1996) 5-hydroxytryptamine receptor 2B
Name:5-hydroxytryptamine receptor 2B
Type:G Protein-Coupled Receptor (GPCR)
Mol. Mass.:54312.47
Organism:Homo sapiens (Human)
Description:Receptor binding assays were performed using human clone stably expressed in CHO cells.
Residue:481
BDBM50130269
NameBDBM50130269
Synonyms:(6aR,9R)-5-Bromo-7-methyl-4,6,6a,7,8,9-hexahydro-indolo[4,3-fg]quinoline-9-carboxylic acid diethylamide CHEMBL274384 | LSD,2-Bromo
TypeSmall organic molecule
Emp. Form.C20H24BrN3O
Mol. Mass.402.328
SMILESCCN(CC)C(=O)[C@H]1CN(C)[C@@H]2Cc3c(Br)[nH]c4cccc(C2=C1)c34