Reaction Details
Target5-hydroxytryptamine receptor 2B
LigandBDBM81498
Substrate/Competitorn/a
Ki 31.8±n/a nM
CommentsPDSP_1643
Citation Wainscott, DBLucaites, VLKursar, JDBaez, MNelson, DL Pharmacologic characterization of the human 5-hydroxytryptamine2B receptor: evidence for species differences. J Pharmacol Exp Ther276:720-7 (1996) 5-hydroxytryptamine receptor 2B
Name:5-hydroxytryptamine receptor 2B
Type:G Protein-Coupled Receptor (GPCR)
Mol. Mass.:54312.47
Organism:Homo sapiens (Human)
Description:Receptor binding assays were performed using human clone stably expressed in CHO cells.
Residue:481
BDBM81498
NameBDBM81498
Synonyms:5-Methoxy-3-(1,2,3,6-tetrahydro-pyridin-4-yl)-1H-indole(RU-24969) CHEMBL18785 RU 24969
TypeSmall organic molecule
Emp. Form.C14H16N2O
Mol. Mass.228.2896
SMILESCOc1ccc2[nH]cc(C3=CCNCC3)c2c1