Reaction Details
TargetGamma-aminobutyric acid receptor subunit alpha-1
LigandBDBM50000766
Substrate/Competitorn/a
Ki 16.8±n/a nM
CommentsPDSP_656
Citation Hadingham, KLGarrett, EMWafford, KABain, CHeavens, RPSirinathsinghji, DJWhiting, PJ Cloning of cDNAs encoding the human gamma-aminobutyric acid type A receptor alpha 6 subunit and characterization of the pharmacology of alpha 6-containing receptors. Mol Pharmacol49:253-9 (1996) Gamma-aminobutyric acid receptor subunit alpha-1
Name:Gamma-aminobutyric acid receptor subunit alpha-1
Type:Protein
Mol. Mass.:51817.35
Organism:Homo sapiens (Human)
Description:P14867
Residue:456
BDBM50000766
NameBDBM50000766
Synonyms:CHEMBL12 US9271961, Diazepam
TypeSmall organic molecule
Emp. Form.C16H13ClN2O
Mol. Mass.284.74
SMILESCN1c2ccc(Cl)cc2C(=NCC1=O)c1ccccc1