Reaction Details
TargetGamma-aminobutyric acid receptor subunit alpha-1
LigandBDBM50243981
Substrate/Competitorn/a
Ki 1±n/a nM
CommentsPDSP_1225
Citation Hadingham, KLGarrett, EMWafford, KABain, CHeavens, RPSirinathsinghji, DJWhiting, PJ Cloning of cDNAs encoding the human gamma-aminobutyric acid type A receptor alpha 6 subunit and characterization of the pharmacology of alpha 6-containing receptors. Mol Pharmacol49:253-9 (1996) Gamma-aminobutyric acid receptor subunit alpha-1
Name:Gamma-aminobutyric acid receptor subunit alpha-1
Type:Protein
Mol. Mass.:51817.35
Organism:Homo sapiens (Human)
Description:P14867
Residue:456
BDBM50243981
NameBDBM50243981
Synonyms:Beta CCM Methyl Beta-carboline-3 carboxylate | methyl 9H-pyrido[3,4-b]indole-3-carboxylate
TypeSmall organic molecule
Emp. Form.C13H10N2O2
Mol. Mass.226.2307
SMILESCOC(=O)c1cc2c(cn1)[nH]c1ccccc21