Reaction Details
TargetGamma-aminobutyric acid receptor subunit alpha-1
LigandBDBM26266
Substrate/Competitorn/a
Ki 20.7±n/a nM
CommentsPDSP_2001
Citation Hadingham, KLGarrett, EMWafford, KABain, CHeavens, RPSirinathsinghji, DJWhiting, PJ Cloning of cDNAs encoding the human gamma-aminobutyric acid type A receptor alpha 6 subunit and characterization of the pharmacology of alpha 6-containing receptors. Mol Pharmacol49:253-9 (1996) Gamma-aminobutyric acid receptor subunit alpha-1
Name:Gamma-aminobutyric acid receptor subunit alpha-1
Type:Protein
Mol. Mass.:51817.35
Organism:Homo sapiens (Human)
Description:P14867
Residue:456
BDBM26266
NameBDBM26266
Synonyms:Ambien Dalparan ZPM Zolpidem tartrate
TypeSmall organic molecule
Emp. Form.C19H21N3O
Mol. Mass.307.3895
SMILESCN(C)C(=O)Cc1c(nc2ccc(C)cn12)-c1ccc(C)cc1