Reaction Details
TargetGamma-aminobutyric acid receptor subunit alpha-6
LigandBDBM50017320
Substrate/Competitorn/a
Ki 12.7±n/a nM
CommentsPDSP_415
Citation Hadingham, KLGarrett, EMWafford, KABain, CHeavens, RPSirinathsinghji, DJWhiting, PJ Cloning of cDNAs encoding the human gamma-aminobutyric acid type A receptor alpha 6 subunit and characterization of the pharmacology of alpha 6-containing receptors. Mol Pharmacol49:253-9 (1996) Gamma-aminobutyric acid receptor subunit alpha-6
Name:Gamma-aminobutyric acid receptor subunit alpha-6
Type:Enzyme Catalytic Domain
Mol. Mass.:51029.60
Organism:Homo sapiens (Human)
Description:GABA A alpha6 0 HUMAN::Q16445
Residue:453
BDBM50017320
NameBDBM50017320
Synonyms:8-Bromo-7-oxo-3b,4,5,6-tetrahydro-7H-2,6a,11b-triaza-benzo[g]cyclopenta[e]azulene-3-carboxylic acid tert-butyl ester CHEMBL444045 | Ro-16-6028
TypeSmall organic molecule
Emp. Form.C19H20BrN3O3
Mol. Mass.418.284
SMILESCC(C)(C)OC(=O)c1ncn-2c1C1CCCN1C(=O)c1c(Br)cccc-21