Reaction Details
TargetMetabotropic glutamate receptor 3
LigandBDBM50004863
Substrate/Competitorn/a
Ki>10000±n/a nM
CommentsPDSP_96
Citation Flor, PJGomeza, JTones, MAKuhn, RPin, JPKnöpfel, T The C-terminal domain of the mGluR1 metabotropic glutamate receptor affects sensitivity to agonists. J Neurochem67:58-63 (1996) 
 
Metabotropic glutamate receptor 3
Name:Metabotropic glutamate receptor 3
Type:Enzyme Catalytic Domain
Mol. Mass.:98889.09
Organism:Homo sapiens (Human)
Description:metabotropic glutamate 1c 0 HUMAN::Q14832
Residue:879
BDBM50004863
NameBDBM50004863
Synonyms:(+/-)-trans-ACPD (1S,3S)-1-aminocyclopentane-1,3-dicarboxylic acid 1-Amino-cyclopentane-1,3-dicarboxylic acid(cis-(1S,3S)-ACPD) 1R,3S-ACPD CHEMBL29726
TypeSmall organic molecule
Emp. Form.C7H11NO4
Mol. Mass.173.1665
SMILESN[C@]1(CC[C@@H](C1)C(O)=O)C(O)=O