Reaction Details
TargetGamma-aminobutyric acid receptor subunit alpha-6
LigandBDBM84957
Substrate/Competitorn/a
Ki 285.48±n/a nM
CommentsPDSP_504
Citation Yang, WDrewe, JALan, NC Cloning and characterization of the human GABAA receptor alpha 4 subunit: identification of a unique diazepam-insensitive binding site. Eur J Pharmacol291:319-25 (1995) 
 
Gamma-aminobutyric acid receptor subunit alpha-6
Name:Gamma-aminobutyric acid receptor subunit alpha-6
Type:Enzyme Catalytic Domain
Mol. Mass.:51029.60
Organism:Homo sapiens (Human)
Description:GABA A alpha6 0 HUMAN::Q16445
Residue:453
BDBM84957
NameBDBM84957
Synonyms:CGS 9896 | CHEMBL20042
TypeSmall organic molecule
Emp. Form.C16H10ClN3O
Mol. Mass.295.723
SMILESClc1ccc(cc1)-n1[nH]c2c(cnc3ccccc23)c1=O