Reaction Details
TargetAlpha-glucosidase MAL12
LigandBDBM50322066
Substrate/Competitorn/a
Meas. Tech.Inhibition Assay
IC50 1.024e+5±n/a nM
Citation Kim, JYLee, JWKim, YSLee, YRyu, YBKim, SRyu, HWCurtis-Long, MJLee, KWLee, WSPark, KH A novel competitive class of α-glucosidase inhibitors: (E)-1-phenyl-3-(4-styrylphenyl)urea derivatives. Chembiochem11:2125-31 (2010) 
 
Alpha-glucosidase MAL12
Name:Alpha-glucosidase MAL12
Type:Protein
Mol. Mass.:68084.32
Organism:Saccharomyces cerevisiae
Description:P53341
Residue:584
BDBM50322066
NameBDBM50322066
Synonyms:3,5-Dihydroxyl-4'-amino-trans-stilbene Stilbene derivative, 3
TypeSmall organic molecule
Emp. Form.C14H13NO2
Mol. Mass.227.2585
SMILESNc1ccc(\C=C\c2cc(O)cc(O)c2)cc1