Reaction Details
TargetAlpha-glucosidase MAL12
LigandBDBM23926
Substrate/Competitorn/a
Meas. Tech.Inhibition Assay
Ki 2.15e+4±n/a nM
IC50 2.64e+4±n/a nM
Citation Kim, JYLee, JWKim, YSLee, YRyu, YBKim, SRyu, HWCurtis-Long, MJLee, KWLee, WSPark, KH A novel competitive class of α-glucosidase inhibitors: (E)-1-phenyl-3-(4-styrylphenyl)urea derivatives. Chembiochem11:2125-31 (2010) 
 
Alpha-glucosidase MAL12
Name:Alpha-glucosidase MAL12
Type:Protein
Mol. Mass.:68084.32
Organism:Saccharomyces cerevisiae
Description:P53341
Residue:584
BDBM23926
NameBDBM23926
Synonyms:(E)-resveratrol CHEMBL165 Stilbene, 2f cid_445154 trans-resveratrol
TypeSmall organic molecule
Emp. Form.C14H12O3
Mol. Mass.228.2433
SMILESOc1ccc(\C=C\c2cc(O)cc(O)c2)cc1