Reaction Details
TargetAlpha-glucosidase MAL12
LigandBDBM84966
Substrate/Competitorn/a
Meas. Tech.Inhibition Assay
Ki 1.21e+4± 3e+2 nM
IC50 2.88e+4± 4e+2 nM
Citation Kim, JYLee, JWKim, YSLee, YRyu, YBKim, SRyu, HWCurtis-Long, MJLee, KWLee, WSPark, KH A novel competitive class of α-glucosidase inhibitors: (E)-1-phenyl-3-(4-styrylphenyl)urea derivatives. Chembiochem11:2125-31 (2010) 
 
Alpha-glucosidase MAL12
Name:Alpha-glucosidase MAL12
Type:Protein
Mol. Mass.:68084.32
Organism:Saccharomyces cerevisiae
Description:P53341
Residue:584
BDBM84966
NameBDBM84966
Synonyms:Urea derivative, 10
TypeSmall organic molecule
Emp. Form.C22H17F3N2O3
Mol. Mass.414.3772
SMILESOc1ccc(\C=C\c2ccc(NC(=O)Nc3ccc(cc3)C(F)(F)F)cc2)cc1O