Reaction Details
TargetAlpha-glucosidase MAL12
LigandBDBM84967
Substrate/Competitorn/a
Meas. Tech.Inhibition Assay
Ki 7.2e+3± 4e+2 nM
IC50 1.98e+4± 1e+2 nM
Citation Kim, JYLee, JWKim, YSLee, YRyu, YBKim, SRyu, HWCurtis-Long, MJLee, KWLee, WSPark, KH A novel competitive class of α-glucosidase inhibitors: (E)-1-phenyl-3-(4-styrylphenyl)urea derivatives. Chembiochem11:2125-31 (2010) 
 
Alpha-glucosidase MAL12
Name:Alpha-glucosidase MAL12
Type:Protein
Mol. Mass.:68084.32
Organism:Saccharomyces cerevisiae
Description:P53341
Residue:584
BDBM84967
NameBDBM84967
Synonyms:Urea derivative, 11
TypeSmall organic molecule
Emp. Form.C21H17FN2O3
Mol. Mass.364.3697
SMILESOc1ccc(\C=C\c2ccc(NC(=O)Nc3ccc(F)cc3)cc2)cc1O