Reaction Details
TargetMitogen-activated protein kinase 10
LigandBDBM50240897
Substrate/Competitorn/a
Meas. Tech.Kinase Assay
Temperature310.15±0 K
IC50 7.7e+3± 1.1e+3 nM
Citation Goettert, MSchattel, VKoch, PMerfort, ILaufer, S Biological evaluation and structural determinants of p38α mitogen-activated-protein kinase and c-Jun-N-terminal kinase 3 inhibition by flavonoids. Chembiochem11:2579-88 (2010) 
 
Mitogen-activated protein kinase 10
Name:Mitogen-activated protein kinase 10
Type:Enzyme
Mol. Mass.:52586.89
Organism:Homo sapiens (Human)
Description:n/a
Residue:464
BDBM50240897
NameBDBM50240897
Synonyms:2-(3,4-dihydroxyphenyl)-5-hydroxy-3,7-dimethoxy-4H-chromen-4-one CHEMBL164861 | Quercetin-3,7-dimethylether
TypeSmall organic molecule
Emp. Form.C17H14O7
Mol. Mass.330.2889
SMILESCOc1cc(O)c2c(c1)oc(-c1ccc(O)c(O)c1)c(OC)c2=O