Reaction Details
TargetSomatostatin receptor type 2
LigandBDBM84629
Substrate/Competitorn/a
Ki 199.52±n/a nM
CommentsPDSP_385
Citation Bruns, CRaulf, FHoyer, DSchloos, JLübbert, HWeckbecker, G Binding properties of somatostatin receptor subtypes. Metab Clin Exp45:17-20 (1996) 
 
Somatostatin receptor type 2
Name:Somatostatin receptor type 2
Type:Enzyme
Mol. Mass.:41344.94
Organism:Homo sapiens (Human)
Description:P30874
Residue:369
BDBM84629
NameBDBM84629
Synonyms:BIM 23056
TypeSmall organic molecule
Emp. Form.C71H81N11O9
Mol. Mass.1232.4711
SMILESCC(C)[C@H](NC(=O)[C@H](CCCCN)NC(=O)[C@@H](Cc1c[nH]c2ccccc12)NC(=O)[C@H](Cc1ccc(O)cc1)NC(=O)[C@H](Cc1ccccc1)NC(=O)[C@H](N)Cc1ccccc1)C(=O)N[C@@H](Cc1ccccc1)C(=O)N[C@H](Cc1cccc2ccccc12)C(N)=O