Reaction Details
TargetSomatostatin receptor type 5
LigandBDBM84987
Substrate/Competitorn/a
Ki 5.01±n/a nM
CommentsPDSP_1592
Citation Bruns, CRaulf, FHoyer, DSchloos, JLübbert, HWeckbecker, G Binding properties of somatostatin receptor subtypes. Metab Clin Exp45:17-20 (1996) 
 
Somatostatin receptor type 5
Name:Somatostatin receptor type 5
Type:Enzyme
Mol. Mass.:39218.02
Organism:Homo sapiens (Human)
Description:P35346
Residue:364
BDBM84987
NameBDBM84987
Synonyms:RC 160II
TypeSmall organic molecule
Emp. Form.C59H72N12O10S2
Mol. Mass.1173.407
SMILESCC(C)C1NC(=O)C(CCCCN)NC(=O)C(Cc2c[nH]c3ccccc23)NC(=O)C(Cc2ccc(O)cc2)NC(=O)C(CSSCC(NC1=O)C(=O)NC(Cc1c[nH]c2ccccc12)C(N)=O)NC(=O)CN(Cc1ccccc1)C(C)=O